{"text_format":"1","workbook":"xlsx","n_sheets":7,"sheets":["Bol II","Bol VI","Bol II SUPL","Bol VI SUPL","Bol II - PGE","Bol II - 11 VPub","Bol II - Nit DA"],"not_rendered":{"charts":0,"images":1,"macros":1,"external_links":0,"defined_names":20,"comments":7,"pivot_tables":0},"unopened":[],"bounds":{"document_bytes":16777216,"sheet_cells":100000,"rows_first":2000,"rows_last":500,"rows_between":2000,"halvings":0,"cell_chars":16384,"cell_head_chars":4096},"cells_cut":0,"cells_raw":0,"read":"whole","date_system":"1900"}

{"sheet":"Bol II","index":0,"n_rows":5070,"n_cols":12,"rows_kept":5070,"cut":false,"hidden":false,"merged":[[12,9,12,11],[3,6,8,11],[9,6,11,11],[12,2,13,2],[12,3,13,3],[12,4,13,4],[12,6,13,6],[12,7,13,7],[12,8,13,8],[12,5,13,5],[4,3,4,5],[7,2,7,5],[10,3,10,5]]}
[]
[]
[]
[null,null,null,null,null,null,"Em cumprimento às cláusulas contidas no Convênio celebrado entre o Tribunal de Justiça do Estado do Rio de Janeiro \ne o Agente de Integração, indicamos abaixo os estudantes que estagiaram em nossas dependências, e para os quais pedimos creditar o valor das bolsas auxílio e dos auxílios transportes nas contas bancárias informadas pelos próprios estudantes, conforme banco de dados do Agente de Integração"]
[null,null,"Frequência do Mês:","Responsável pela informação :  "]
[]
[]
[null,null,"Nome da Empresa :  TRIBUNAL DE JUSTIÇA DO ESTADO DO RIO DE JANEIRO   -   tel :  3133-7650"]
[]
[null,null,null,null,null,null,"Valor bruto da bolsa auxílio :                        BOL II GERAL"]
[null,null,"Data de envio :  dd / mm / aaaa","Endereço :  Praça XV de Novembro, nª 02, sala 107, 1ª andar"]
[]
[null,null,"5-Serventia","6-Matricula da Instituição","7-Nome completo dos universitários","8-Periodo","Valor Líquido da Bolsa Auxílio","Valor Líquido do Auxílio Transporte","Valor Líquido Total","Observação"]
[null,null,null,null,null,null,null,null,null,"Ocorrência","Data","Faltas"]
[{"$f":"IF(C15=0,0,1)","v":0},1]
[null,2]
[null,3]
[null,4]
[null,5]
[null,6]
[null,7]
[null,8]
[null,9]
[{"$f":"IF(C24=0,0,1)","v":0},10]
[null,11]
[null,12]
[null,13]
[null,14]
[null,15]
[null,16]
[null,17]
[null,18]
[null,19]
[null,20]
[null,21]
[null,22]
[null,23]
[null,24]
[null,25]
[null,26]
[null,27]
[null,28]
[null,29]
[null,30]
[null,31]
[null,32]
[null,33]
[null,34]
[null,35]
[null,36]
[null,37]
[null,38]
[null,39]
[null,40]
[null,41]
[null,42]
[null,43]
[null,44]
[null,45]
[null,46]
[null,47]
[null,48]
[null,49]
[null,50]
[null,51]
[null,52]
[null,53]
[null,54]
[null,55]
[null,56]
[null,57]
[null,58]
[null,59]
[null,60]
[null,61]
[null,62]
[null,63]
[null,64]
[null,65]
[null,66]
[null,67]
[null,68]
[null,69]
[null,70]
[null,71]
[null,72]
[null,73]
[null,74]
[null,75]
[null,76]
[null,77]
[null,78]
[null,79]
[null,80]
[null,81]
[null,82]
[null,83]
[null,84]
[null,85]
[null,86]
[null,87]
[null,88]
[null,89]
[null,90]
[null,91]
[null,92]
[null,93]
[null,94]
[null,95]
[null,96]
[null,97]
[null,98]
[null,99]
[null,100]
[null,101]
[null,102]
[null,103]
[null,104]
[null,105]
[null,106]
{"$rows_left_out":4951}
{"sheet":"Bol VI","index":1,"n_rows":124,"n_cols":12,"rows_kept":124,"cut":false,"hidden":false,"merged":[[12,7,13,7],[12,8,13,8],[12,9,12,11],[3,6,8,11],[4,3,4,5],[7,2,7,5],[9,6,11,11],[10,3,10,5],[12,2,13,2],[12,3,13,3],[12,4,13,4],[12,5,13,5],[12,6,13,6]]}
[]
[]
[]
[null,null,null,null,null,null,"Em cumprimento às cláusulas contidas no Convênio celebrado entre o Tribunal de Justiça do Estado do Rio de Janeiro \ne o Agente de Integração, indicamos abaixo os estudantes que estagiaram em nossas dependências, e para os quais pedimos creditar o valor das bolsas auxílio e dos auxílios transportes nas contas bancárias informadas pelos próprios estudantes, conforme banco de dados do Agente de Integração"]
[null,null,{"$f":"'Bol II'!C5","v":"Frequência do Mês:"},{"$f":"'Bol II'!D5:F5","v":"Responsável pela informação :  "}]
[]
[]
[null,null,"Nome da Empresa :  TRIBUNAL DE JUSTIÇA DO ESTADO DO RIO DE JANEIRO   -   tel :  3133-7650"]
[]
[null,null,null,null,null,null,"Valor bruto da bolsa auxílio :                       BOL VI GERAL"]
[null,null,"Data de envio :  dd / mm / aaaa","Endereço :  Praça XV de Novembro, nª 02, sala 107, 1ª andar"]
[]
[null,null,"5-Serventia","6-Matricula da Instituição","7-Nome completo dos universitários","8-Periodo","Valor Líquido da Bolsa Auxílio","Valor Líquido do Auxílio Transporte","Valor Líquido Total","Observação"]
[null,null,null,null,null,null,null,null,null,"Ocorrência","Data","Faltas"]
[{"$f":"IF(C15=0,0,1)","v":0},1]
[{"$f":"IF(C16=0,0,1)","v":0},2]
[0,3]
[0,4]
[0,5]
[0,6]
[0,7]
[0,8]
[0,9]
[0,10]
[0,11]
[0,12]
[0,13]
[0,14]
[0,15]
[0,16]
[0,17]
[0,18]
[0,19]
[0,20]
[0,21]
[0,22]
[0,23]
[0,24]
[0,25]
[0,26]
[0,27]
[0,28]
[0,29]
[0,30]
[0,31]
[0,32]
[0,33]
[0,34]
[0,35]
[0,36]
[0,37]
[{"$f":"IF(C52=0,0,1)","v":0},38]
[0,39]
[0,40]
[0,41]
[0,42]
[0,43]
[0,44]
[null,45]
[null,46]
[null,47]
[null,48]
[null,49]
[null,50]
[null,51]
[null,52]
[null,53]
[null,54]
[null,55]
[null,56]
[null,57]
[null,58]
[null,59]
[null,60]
[null,61]
[null,62]
[null,63]
[null,64]
[null,65]
[null,66]
[null,67]
[null,68]
[null,69]
[null,70]
[null,71]
[null,72]
[null,73]
[null,74]
[null,75]
[null,76]
[null,77]
[null,78]
[null,79]
[null,80]
[]
[]
[]
[]
[]
[]
[{"$f":"IF(C101=0,0,1)","v":1},null,81,null,null,{"$f":"VLOOKUP(E101,#REF!,2,FALSE)","v":{"$error":"#REF!"}}]
[1,null,82,null,null,{"$f":"VLOOKUP(E102,#REF!,2,FALSE)","v":{"$error":"#REF!"}}]
[1,null,83,null,null,{"$f":"VLOOKUP(E103,#REF!,2,FALSE)","v":{"$error":"#REF!"}}]
[1,null,84,null,null,{"$f":"VLOOKUP(E104,#REF!,2,FALSE)","v":{"$error":"#REF!"}}]
[1,null,85,null,null,{"$f":"VLOOKUP(E105,#REF!,2,FALSE)","v":{"$error":"#REF!"}}]
[1,null,86,null,null,{"$f":"VLOOKUP(E106,#REF!,2,FALSE)","v":{"$error":"#REF!"}}]
[1,null,87,null,null,{"$f":"VLOOKUP(E107,#REF!,2,FALSE)","v":{"$error":"#REF!"}}]
[1,null,88,null,null,{"$f":"VLOOKUP(E108,#REF!,2,FALSE)","v":{"$error":"#REF!"}}]
[1,null,89,null,null,{"$f":"VLOOKUP(E109,#REF!,2,FALSE)","v":{"$error":"#REF!"}}]
[1,null,90,null,null,{"$f":"VLOOKUP(E110,#REF!,2,FALSE)","v":{"$error":"#REF!"}}]
[null,null,91,null,null,{"$f":"VLOOKUP(E111,#REF!,2,FALSE)","v":{"$error":"#REF!"}}]
[null,null,92,null,null,{"$f":"VLOOKUP(E112,#REF!,2,FALSE)","v":{"$error":"#REF!"}}]
[null,null,93,null,null,{"$f":"VLOOKUP(E113,#REF!,2,FALSE)","v":{"$error":"#REF!"}}]
[null,null,94,null,null,{"$f":"VLOOKUP(E114,#REF!,2,FALSE)","v":{"$error":"#REF!"}}]
[null,null,95,null,null,{"$f":"VLOOKUP(E115,#REF!,2,FALSE)","v":{"$error":"#REF!"}}]
[null,null,96,null,null,{"$f":"VLOOKUP(E116,#REF!,2,FALSE)","v":{"$error":"#REF!"}}]
[null,null,97,null,null,{"$f":"VLOOKUP(E117,#REF!,2,FALSE)","v":{"$error":"#REF!"}}]
[]
[null,null,null,null,"Soma das Bolsas Auxílio  ( A )",{"$f":"SUM(G15:G117)","v":0}]
[null,null,null,null,"Contribuição Institucional  -  com frequência lançada (B)",{"$f":"F124*19","v":0}]
{"$rows_left_out":5}
{"sheet":"Bol II SUPL","index":2,"n_rows":254,"n_cols":12,"rows_kept":254,"cut":false,"hidden":false,"merged":[[12,7,13,7],[12,8,13,8],[12,9,12,11],[3,6,8,11],[4,3,4,5],[7,2,7,5],[9,6,11,11],[10,3,10,5],[12,2,13,2],[12,3,13,3],[12,4,13,4],[12,5,13,5],[12,6,13,6]]}
[]
[]
[]
[null,null,null,null,null,null,"Em cumprimento às cláusulas contidas no Convênio celebrado entre o Tribunal de Justiça do Estado do Rio de Janeiro \ne o Agente de Integração, indicamos abaixo os estudantes que estagiaram em nossas dependências, e para os quais pedimos creditar o valor das bolsas auxílio e dos auxílios transportes nas contas bancárias informadas pelos próprios estudantes, conforme banco de dados do Agente de Integração"]
[null,null,{"$f":"'Bol II'!C5","v":"Frequência do Mês:"},{"$f":"'Bol II'!D5:F5","v":"Responsável pela informação :  "}]
[]
[]
[null,null,"Nome da Empresa :  TRIBUNAL DE JUSTIÇA DO ESTADO DO RIO DE JANEIRO   -   tel :  3133-7650"]
[]
[null,null,null,null,null,null,"Valor bruto da bolsa auxílio :                 BOL II FOLHA SUPLEMENTAR  ( FNL )"]
[null,null,"Data de envio :  dd / mm / aaaa","Endereço :  Praça XV de Novembro, nª 02, sala 107, 1ª andar"]
[]
[null,null,"5-Serventia","6-Matricula da Instituição","7-Nome completo dos universitários","8-Periodo","Valor Líquido da Bolsa Auxílio","Valor Líquido do Auxílio Transporte","Valor Líquido Total","Observação"]
[null,null,null,null,null,null,null,null,null,"Ocorrência","Data","Faltas"]
[null,1]
[null,2]
[null,3]
[null,4]
[null,5]
[null,6]
[null,7]
[null,8]
[null,9]
[null,10]
[null,11]
[null,12]
[null,13]
[null,14]
[null,15]
[null,16]
[null,17]
[null,18]
[null,19]
[null,20]
[null,21]
[null,22]
[null,23]
[null,24]
[null,25]
[null,26]
[null,27]
[null,28]
[null,29]
[null,30]
[null,31]
[null,32]
[null,33]
[null,34]
[null,35]
[null,36]
[null,37]
[null,38]
[null,39]
[null,40]
[null,41]
[null,42]
[null,43]
[null,44]
[null,45]
[null,46]
[null,47]
[null,48]
[null,49]
[null,50]
[null,51]
[null,52]
[null,53]
[null,54]
[null,55]
[null,56]
[null,57]
[null,58]
[null,59]
[null,60]
[null,61]
[null,62]
[null,63]
[null,64]
[null,65]
[null,66]
[null,67]
[null,68]
[null,69]
[null,70]
[null,71]
[null,72]
[null,73]
[null,74]
[null,75]
[null,76]
[null,77]
[null,78]
[null,79]
[null,80]
[null,81]
[null,82]
[null,83]
[null,84]
[null,85]
[null,86]
[null,87]
[null,88]
[null,89]
[null,90]
[null,91]
[null,92]
[null,93]
[null,94]
[null,95]
[null,96]
[null,97]
[null,98]
[null,99]
[null,100]
[null,101]
[null,102]
[null,103]
[null,104]
[null,105]
[null,106]
{"$rows_left_out":135}
{"sheet":"Bol VI SUPL","index":3,"n_rows":90,"n_cols":12,"rows_kept":90,"cut":false,"hidden":false,"merged":[[12,7,13,7],[12,8,13,8],[12,9,12,11],[3,6,8,11],[4,3,4,5],[7,2,7,5],[9,6,11,11],[10,3,10,5],[12,2,13,2],[12,3,13,3],[12,4,13,4],[12,5,13,5],[12,6,13,6]]}
[]
[]
[]
[null,null,null,null,null,null,"Em cumprimento às cláusulas contidas no Convênio celebrado entre o Tribunal de Justiça do Estado do Rio de Janeiro \ne o Agente de Integração, indicamos abaixo os estudantes que estagiaram em nossas dependências, e para os quais pedimos creditar o valor das bolsas auxílio e dos auxílios transportes nas contas bancárias informadas pelos próprios estudantes, conforme banco de dados do Agente de Integração"]
[null,null,{"$f":"'Bol II'!C5","v":"Frequência do Mês:"},{"$f":"'Bol II'!D5:F5","v":"Responsável pela informação :  "}]
[]
[]
[null,null,"Nome da Empresa :  TRIBUNAL DE JUSTIÇA DO ESTADO DO RIO DE JANEIRO   -   tel :  3133-7650"]
[]
[null,null,null,null,null,null,"Valor bruto da bolsa auxílio :                       BOL VI FOLHA SUPLEMENTAR  ( FNL )"]
[null,null,"Data de envio :  dd / mm / aaaa","Endereço :  Praça XV de Novembro, nª 02, sala 107, 1ª andar"]
[]
[null,null,"5-Serventia","6-Matricula da Instituição","7-Nome completo dos universitários","8-Periodo","Valor Líquido da Bolsa Auxílio","Valor Líquido do Auxílio Transporte","Valor Líquido Total","Observação"]
[null,null,null,null,null,null,null,null,null,"Ocorrência","Data","Faltas"]
[{"$f":"IF(C15=0,0,1)","v":0},1]
[null,2]
[null,null,null,null,null,{"$f":"VLOOKUP(E17,#REF!,2,FALSE)","v":{"$error":"#REF!"}}]
[null,null,null,null,null,{"$f":"VLOOKUP(E18,#REF!,2,FALSE)","v":{"$error":"#REF!"}}]
[null,null,null,null,null,{"$f":"VLOOKUP(E19,#REF!,2,FALSE)","v":{"$error":"#REF!"}}]
[null,null,null,null,null,{"$f":"VLOOKUP(E20,#REF!,2,FALSE)","v":{"$error":"#REF!"}}]
[null,null,null,null,null,{"$f":"VLOOKUP(E21,#REF!,2,FALSE)","v":{"$error":"#REF!"}}]
[null,null,null,null,null,{"$f":"VLOOKUP(E22,#REF!,2,FALSE)","v":{"$error":"#REF!"}}]
[null,null,null,null,null,{"$f":"VLOOKUP(E23,#REF!,2,FALSE)","v":{"$error":"#REF!"}}]
[null,null,null,null,null,{"$f":"VLOOKUP(E24,#REF!,2,FALSE)","v":{"$error":"#REF!"}}]
[null,null,null,null,null,{"$f":"VLOOKUP(E25,#REF!,2,FALSE)","v":{"$error":"#REF!"}}]
[null,null,null,null,null,{"$f":"VLOOKUP(E26,#REF!,2,FALSE)","v":{"$error":"#REF!"}}]
[null,null,null,null,null,{"$f":"VLOOKUP(E27,#REF!,2,FALSE)","v":{"$error":"#REF!"}}]
[null,null,null,null,null,{"$f":"VLOOKUP(E28,#REF!,2,FALSE)","v":{"$error":"#REF!"}}]
[null,null,null,null,null,{"$f":"VLOOKUP(E29,#REF!,2,FALSE)","v":{"$error":"#REF!"}}]
[null,null,null,null,null,{"$f":"VLOOKUP(E30,#REF!,2,FALSE)","v":{"$error":"#REF!"}}]
[null,null,null,null,null,{"$f":"VLOOKUP(E31,#REF!,2,FALSE)","v":{"$error":"#REF!"}}]
[null,null,null,null,null,{"$f":"VLOOKUP(E32,#REF!,2,FALSE)","v":{"$error":"#REF!"}}]
[null,null,null,null,null,{"$f":"VLOOKUP(E33,#REF!,2,FALSE)","v":{"$error":"#REF!"}}]
[null,null,null,null,null,{"$f":"VLOOKUP(E34,#REF!,2,FALSE)","v":{"$error":"#REF!"}}]
[null,null,null,null,null,{"$f":"VLOOKUP(E35,#REF!,2,FALSE)","v":{"$error":"#REF!"}}]
[null,null,null,null,null,{"$f":"VLOOKUP(E36,#REF!,2,FALSE)","v":{"$error":"#REF!"}}]
[null,null,null,null,null,{"$f":"VLOOKUP(E37,#REF!,2,FALSE)","v":{"$error":"#REF!"}}]
[null,null,null,null,null,{"$f":"VLOOKUP(E38,#REF!,2,FALSE)","v":{"$error":"#REF!"}}]
[null,null,null,null,null,{"$f":"VLOOKUP(E39,#REF!,2,FALSE)","v":{"$error":"#REF!"}}]
[null,null,null,null,null,{"$f":"VLOOKUP(E40,#REF!,2,FALSE)","v":{"$error":"#REF!"}}]
[null,null,null,null,null,{"$f":"VLOOKUP(E41,#REF!,2,FALSE)","v":{"$error":"#REF!"}}]
[null,null,null,null,null,{"$f":"VLOOKUP(E42,#REF!,2,FALSE)","v":{"$error":"#REF!"}}]
[null,null,null,null,null,{"$f":"VLOOKUP(E43,#REF!,2,FALSE)","v":{"$error":"#REF!"}}]
[null,null,null,null,null,{"$f":"VLOOKUP(E44,#REF!,2,FALSE)","v":{"$error":"#REF!"}}]
[null,null,null,null,null,{"$f":"VLOOKUP(E45,#REF!,2,FALSE)","v":{"$error":"#REF!"}}]
[null,null,null,null,null,{"$f":"VLOOKUP(E46,#REF!,2,FALSE)","v":{"$error":"#REF!"}}]
[null,null,null,null,null,{"$f":"VLOOKUP(E47,#REF!,2,FALSE)","v":{"$error":"#REF!"}}]
[null,null,null,null,null,{"$f":"VLOOKUP(E48,#REF!,2,FALSE)","v":{"$error":"#REF!"}}]
[null,null,null,null,null,{"$f":"VLOOKUP(E49,#REF!,2,FALSE)","v":{"$error":"#REF!"}}]
[null,null,null,null,null,{"$f":"VLOOKUP(E50,#REF!,2,FALSE)","v":{"$error":"#REF!"}}]
[null,null,null,null,null,{"$f":"VLOOKUP(E51,#REF!,2,FALSE)","v":{"$error":"#REF!"}}]
[null,null,null,null,null,{"$f":"VLOOKUP(E52,#REF!,2,FALSE)","v":{"$error":"#REF!"}}]
[null,null,null,null,null,{"$f":"VLOOKUP(E53,#REF!,2,FALSE)","v":{"$error":"#REF!"}}]
[null,null,null,null,null,{"$f":"VLOOKUP(E54,#REF!,2,FALSE)","v":{"$error":"#REF!"}}]
[null,null,null,null,null,{"$f":"VLOOKUP(E55,#REF!,2,FALSE)","v":{"$error":"#REF!"}}]
[null,null,null,null,null,{"$f":"VLOOKUP(E56,#REF!,2,FALSE)","v":{"$error":"#REF!"}}]
[null,null,null,null,null,{"$f":"VLOOKUP(E57,#REF!,2,FALSE)","v":{"$error":"#REF!"}}]
[null,null,null,null,null,{"$f":"VLOOKUP(E58,#REF!,2,FALSE)","v":{"$error":"#REF!"}}]
[null,null,null,null,null,{"$f":"VLOOKUP(E59,#REF!,2,FALSE)","v":{"$error":"#REF!"}}]
[null,null,null,null,null,{"$f":"VLOOKUP(E60,#REF!,2,FALSE)","v":{"$error":"#REF!"}}]
[null,null,null,null,null,{"$f":"VLOOKUP(E61,#REF!,2,FALSE)","v":{"$error":"#REF!"}}]
[null,null,null,null,null,{"$f":"VLOOKUP(E62,#REF!,2,FALSE)","v":{"$error":"#REF!"}}]
[null,null,null,null,null,{"$f":"VLOOKUP(E63,#REF!,2,FALSE)","v":{"$error":"#REF!"}}]
[null,null,null,null,null,{"$f":"VLOOKUP(E64,#REF!,2,FALSE)","v":{"$error":"#REF!"}}]
[null,null,null,null,null,{"$f":"VLOOKUP(E65,#REF!,2,FALSE)","v":{"$error":"#REF!"}}]
[null,null,null,null,null,{"$f":"VLOOKUP(E66,#REF!,2,FALSE)","v":{"$error":"#REF!"}}]
[null,null,null,null,null,{"$f":"VLOOKUP(E67,#REF!,2,FALSE)","v":{"$error":"#REF!"}}]
[null,null,null,null,null,{"$f":"VLOOKUP(E68,#REF!,2,FALSE)","v":{"$error":"#REF!"}}]
[null,null,null,null,null,{"$f":"VLOOKUP(E69,#REF!,2,FALSE)","v":{"$error":"#REF!"}}]
[null,null,null,null,null,{"$f":"VLOOKUP(E70,#REF!,2,FALSE)","v":{"$error":"#REF!"}}]
[null,null,null,null,null,{"$f":"VLOOKUP(E71,#REF!,2,FALSE)","v":{"$error":"#REF!"}}]
[null,null,null,null,null,{"$f":"VLOOKUP(E72,#REF!,2,FALSE)","v":{"$error":"#REF!"}}]
[null,null,null,null,null,{"$f":"VLOOKUP(E73,#REF!,2,FALSE)","v":{"$error":"#REF!"}}]
[null,null,null,null,null,{"$f":"VLOOKUP(E74,#REF!,2,FALSE)","v":{"$error":"#REF!"}}]
[null,null,null,null,null,{"$f":"VLOOKUP(E75,#REF!,2,FALSE)","v":{"$error":"#REF!"}}]
[null,null,null,null,null,{"$f":"VLOOKUP(E76,#REF!,2,FALSE)","v":{"$error":"#REF!"}}]
[null,null,null,null,null,{"$f":"VLOOKUP(E77,#REF!,2,FALSE)","v":{"$error":"#REF!"}}]
[null,null,null,null,null,{"$f":"VLOOKUP(E78,#REF!,2,FALSE)","v":{"$error":"#REF!"}}]
[null,null,null,null,null,{"$f":"VLOOKUP(E79,#REF!,2,FALSE)","v":{"$error":"#REF!"}}]
[null,null,null,null,null,{"$f":"VLOOKUP(E80,#REF!,2,FALSE)","v":{"$error":"#REF!"}}]
[null,null,null,null,null,{"$f":"VLOOKUP(E81,#REF!,2,FALSE)","v":{"$error":"#REF!"}}]
[null,null,null,null,null,{"$f":"VLOOKUP(E82,#REF!,2,FALSE)","v":{"$error":"#REF!"}}]
[null,null,null,null,null,{"$f":"VLOOKUP(E83,#REF!,2,FALSE)","v":{"$error":"#REF!"}}]
[null,null,null,null,null,{"$f":"VLOOKUP(E84,#REF!,2,FALSE)","v":{"$error":"#REF!"}}]
[null,null,null,null,null,{"$f":"VLOOKUP(E85,#REF!,2,FALSE)","v":{"$error":"#REF!"}}]
[null,null,null,null,null,null,{"$f":"SUM(G15:G85)","v":0},{"$f":"SUM(H15:H85)","v":0},{"$f":"SUM(I15:I85)","v":0}]
[null,null,null,null,"Soma das Bolsas Auxílio  ( A )",{"$f":"SUM(G15:G85)","v":0}]
[null,null,null,null,"Soma dos Aux. Locomoção  (B )",{"$f":"SUM(H15:H85)","v":0}]
[null,null,null,null,"Soma dos Campos  ( A + B )",{"$f":"SUM(F87:F88)","v":0}]
[null,null,null,null,"Total de Universitários",{"$f":"SUBTOTAL(103,C15:C85)","v":0}]

{"sheet":"Bol II - PGE","index":4,"n_rows":133,"n_cols":12,"rows_kept":133,"cut":false,"hidden":false,"merged":[[12,7,13,7],[12,8,13,8],[12,9,12,11],[3,6,8,11],[4,3,4,5],[7,2,7,5],[9,6,11,11],[10,3,10,5],[12,2,13,2],[12,3,13,3],[12,4,13,4],[12,5,13,5],[12,6,13,6]]}
[]
[]
[]
[null,null,null,null,null,null,"Em cumprimento às cláusulas contidas no Convênio celebrado entre o Tribunal de Justiça do Estado do Rio de Janeiro \ne o Agente de Integração, indicamos abaixo os estudantes que estagiaram em nossas dependências, e para os quais pedimos creditar o valor das bolsas auxílio e dos auxílios transportes nas contas bancárias informadas pelos próprios estudantes, conforme banco de dados do Agente de Integração"]
[null,null,{"$f":"'Bol II SUPL'!C5","v":"Frequência do Mês:"},"Responsável pela informação :  "]
[]
[]
[null,null,"Nome da Empresa :  TRIBUNAL DE JUSTIÇA DO ESTADO DO RIO DE JANEIRO   -   tel :  3133-7650"]
[]
[null,null,null,null,null,null,"Valor bruto da bolsa auxílio :                    BOL II PGE"]
[null,null,"Data de envio :  ___ /___ /___","Endereço :  Praça XV de Novembro, nª 02, sala 107, 1ª andar"]
[]
[null,null,"5-Serventia","6-Matricula da Instituição","7-Nome completo dos universitários","8-Periodo","Valor Líquido da Bolsa Auxílio","Valor Líquido do Auxílio Transporte","Valor Líquido Total","Observação"]
[null,null,null,null,null,null,null,null,null,"Ocorrência","Data","Faltas"]
[{"$f":"IF(C15=0,0,1)","v":0},1]
[{"$f":"IF(C16=0,0,1)","v":0},2]
[null,3]
[null,4]
[null,5]
[null,6]
[null,7]
[null,8]
[null,9]
[null,10]
[null,11]
[null,12]
[null,13]
[null,14]
[null,15]
[null,16]
[null,17]
[null,18]
[null,19]
[null,20]
[null,21]
[null,22]
[null,23]
[null,24]
[null,25]
[null,26]
[null,27]
[null,28]
[null,29]
[null,30]
[null,31]
[null,32]
[null,33]
[null,34]
[null,35]
[null,36]
[null,37]
[null,38]
[null,39]
[0,40]
[0,41]
[0,42]
[0,43]
[0,44]
[0,45]
[0,46]
[0,47]
[0,48]
[null,49]
[null,50]
[null,51]
[null,52]
[0,53]
[null,54]
[null,55]
[null,56]
[null,57]
[null,58]
[null,59]
[null,60]
[null,61]
[null,62]
[null,63]
[null,64]
[null,65]
[null,66]
[null,67]
[null,68]
[null,69]
[null,70]
[null,71]
[null,72]
[null,73]
[null,74]
[null,75]
[1,76,101]
[1,77,102]
[1,78,103]
[1,79,104]
[1,80,105]
[1,81,106]
[1,82,107]
[1,83,108]
[1,84,109]
[1,85,110]
[1,86,111]
[1,87,112]
[1,88,113]
[1,89,114]
[1,90,115]
[1,91,116]
[1,92,117]
[1,93,118]
[1,94,119]
[1,95,120]
[1,96,121]
[1,97,122]
[1,98,123]
[1,99,124]
[1,100,125]
[1,101,126]
[1,102,127]
[1,103,128]
[1,104,129]
[1,105,130]
[1,106,131]
{"$rows_left_out":14}
{"sheet":"Bol II - 11 VPub","index":5,"n_rows":130,"n_cols":12,"rows_kept":130,"cut":false,"hidden":false,"merged":[[12,7,13,7],[12,8,13,8],[12,9,12,11],[3,6,8,11],[4,3,4,5],[7,2,7,5],[9,6,11,11],[10,3,10,5],[12,2,13,2],[12,3,13,3],[12,4,13,4],[12,5,13,5],[12,6,13,6]]}
[]
[]
[]
[null,null,null,null,null,null,"Em cumprimento às cláusulas contidas no Convênio celebrado entre o Tribunal de Justiça do Estado do Rio de Janeiro \ne o Agente de Integração, indicamos abaixo os estudantes que estagiaram em nossas dependências, e para os quais pedimos creditar o valor das bolsas auxílio e dos auxílios transportes nas contas bancárias informadas pelos próprios estudantes, conforme banco de dados do Agente de Integração"]
[null,null,{"$f":"'Bol II SUPL'!C5","v":"Frequência do Mês:"},"Responsável pela informação :  "]
[]
[]
[null,null,"Nome da Empresa :  TRIBUNAL DE JUSTIÇA DO ESTADO DO RIO DE JANEIRO   -   tel :  3133-7650"]
[]
[null,null,null,null,null,null,"Valor bruto da bolsa auxílio :               BOL II 11ª V. FAZ. PÚBLICA"]
[null,null,"Data de envio :  ___ /___ /___","Endereço :  Praça XV de Novembro, nª 02, sala 107, 1ª andar"]
[]
[null,null,"5-Serventia","6-Matricula da Instituição","7-Nome completo dos universitários","8-Periodo","Valor Líquido da Bolsa Auxílio","Valor Líquido do Auxílio Transporte","Valor Líquido Total","Observação"]
[null,null,null,null,null,null,null,null,null,"Ocorrência","Data","Faltas"]
[{"$f":"IF(C15=0,0,1)","v":0},1]
[{"$f":"IF(C16=0,0,1)","v":0},2]
[null,3]
[null,4]
[null,5]
[null,6]
[null,7]
[null,8]
[null,9]
[null,10]
[null,11]
[null,12]
[null,13]
[null,14]
[null,15]
[null,16]
[null,17]
[null,18]
[null,19]
[null,20]
[null,21]
[null,22]
[null,23]
[null,24]
[null,25]
[null,26]
[null,27]
[null,28]
[null,29]
[null,30]
[null,31]
[null,32]
[null,33]
[null,34]
[0,35]
[0,36]
[0,37]
[0,38]
[0,39]
[0,40]
[0,41]
[0,42]
[0,43]
[null,44]
[null,45]
[null,46]
[null,47]
[0,48]
[null,49]
[null,50]
[null,51]
[null,52]
[null,53]
[null,54]
[null,55]
[null,56]
[null,57]
[null,58]
[null,59]
[null,60]
[null,61]
[null,62]
[null,63]
[null,64]
[null,65]
[null,66]
[null,67]
[null,68]
[null,69]
[null,70]
[null,71]
[null,72]
[0,73]
[0,74]
[0,75]
[0,76]
[0,77]
[0,78]
[0,79]
[0,80]
[0,81]
[0,82]
[0,83]
[0,84]
[0,85]
[0,86]
[0,87]
[0,88]
[0,89]
[0,90]
[0,91]
[0,92]
[0,93]
[0,94]
[0,95]
[0,96]
[0,97]
[0,98]
[0,99]
[0,100]
[0,101]
[0,102]
[0,103]
[0,104]
[0,105]
[0,106]
{"$rows_left_out":11}
{"sheet":"Bol II - Nit DA","index":6,"n_rows":134,"n_cols":12,"rows_kept":134,"cut":false,"hidden":false,"merged":[[12,7,13,7],[12,8,13,8],[12,9,12,11],[3,6,8,11],[4,3,4,5],[7,2,7,5],[9,6,11,11],[10,3,10,5],[12,2,13,2],[12,3,13,3],[12,4,13,4],[12,5,13,5],[12,6,13,6]]}
[]
[]
[]
[null,null,null,null,null,null,"Em cumprimento às cláusulas contidas no Convênio celebrado entre o Tribunal de Justiça do Estado do Rio de Janeiro \ne o Agente de Integração, indicamos abaixo os estudantes que estagiaram em nossas dependências, e para os quais pedimos creditar o valor das bolsas auxílio e dos auxílios transportes nas contas bancárias informadas pelos próprios estudantes, conforme banco de dados do Agente de Integração"]
[null,null,{"$f":"'Bol II SUPL'!C5","v":"Frequência do Mês:"},"Responsável pela informação :  "]
[]
[]
[null,null,"Nome da Empresa :  TRIBUNAL DE JUSTIÇA DO ESTADO DO RIO DE JANEIRO   -   tel :  3133-7650"]
[]
[null,null,null,null,null,null,"Valor bruto da bolsa auxílio :  R$ 830,76  BOL II DA NITERÓI"]
[null,null,"Data de envio :  ___ /___ /___","Endereço :  Praça XV de Novembro, nª 02, sala 107, 1ª andar"]
[]
[null,null,"5-Serventia","6-Matricula da Instituição","7-Nome completo dos universitários","8-Periodo","Valor Líquido da Bolsa Auxílio","Valor Líquido do Auxílio Transporte","Valor Líquido Total","Observação"]
[null,null,null,null,null,null,null,null,null,"Ocorrência","Data","Faltas"]
[{"$f":"IF(C15=0,0,1)","v":0},1]
[{"$f":"IF(C16=0,0,1)","v":0},2]
[null,3]
[null,4]
[null,5]
[null,6]
[null,7]
[null,8]
[null,9]
[null,10]
[null,11]
[null,12]
[null,13]
[null,14]
[null,15]
[null,16]
[null,17]
[null,18]
[null,19]
[null,20]
[null,21]
[null,22]
[null,23]
[null,24]
[null,25]
[null,26]
[null,27]
[null,28]
[null,29]
[null,30]
[]
[]
[]
[]
[]
[]
[]
[]
[]
[]
[0]
[0]
[0]
[0]
[0]
[0]
[0]
[0]
[0]
[]
[]
[]
[]
[0]
[]
[]
[]
[]
[]
[]
[]
[]
[]
[]
[]
[]
[]
[]
[]
[]
[]
[]
[]
[]
[]
[]
[0]
[0]
[0]
[0]
[0]
[0]
[0]
[0]
[0]
[0]
[0]
[0]
[0]
[0]
[0]
[0]
[0]
[0]
[0]
[0]
[0]
[0]
[0]
[0]
[0]
[0]
[0]
[0]
[0]
[0]
{"$rows_left_out":14}